{"text_format":"1","workbook":"xlsx","n_sheets":10,"sheets":["道路工事施行承認申請書","担当者設定","データ_コード表","データ_選択肢","M_添付書類","M_数量単位","M_工事内容_項目1","M_工事内容_項目2","M_工事内容_項目3","(Validate)"],"not_rendered":{"charts":0,"images":8,"macros":1,"external_links":1,"defined_names":82,"comments":0,"pivot_tables":0},"unopened":[],"bounds":{"document_bytes":16777216,"sheet_cells":100000,"rows_first":2000,"rows_last":500,"rows_between":2000,"halvings":0,"cell_chars":16384,"cell_head_chars":4096},"cells_cut":0,"cells_raw":0,"read":"whole","date_system":"1900"}

{"sheet":"道路工事施行承認申請書","index":0,"n_rows":63,"n_cols":55,"rows_kept":63,"cut":false,"hidden":false,"merged":[[62,0,63,12],[7,39,8,41],[7,42,8,43],[7,44,8,45],[7,46,8,47],[7,48,8,49],[7,50,8,51],[7,52,8,53],[8,3,9,15],[8,26,9,29],[8,31,9,37],[25,46,25,49],[25,40,25,43],[25,38,25,39],[25,18,25,37],[23,1,23,53],[10,31,12,53],[11,26,12,29],[12,18,14,23],[13,31,15,53],[14,26,15,29],[24,12,24,55],[32,3,32,8],[33,3,33,8],[32,13,32,15],[32,16,32,17],[32,18,32,19],[32,20,32,21],[32,51,32,54],[25,3,25,8],[33,13,33,18],[33,20,33,36],[33,37,33,40],[33,42,33,55],[32,37,32,38],[32,39,32,40],[32,41,32,42],[32,43,32,44],[32,47,32,50],[32,22,32,23],[32,24,32,25],[32,30,32,32],[32,33,32,34],[29,45,29,49],[28,45,28,49],[30,13,30,24],[27,50,27,54],[28,50,28,54],[43,31,44,36],[43,37,44,42],[38,0,48,4],[40,5,42,55],[38,41,39,55],[39,5,39,16],[39,17,39,28],[39,29,39,40],[38,29,38,40],[38,17,38,28],[38,5,38,16],[49,1,50,5],[49,31,50,54],[51,1,57,29],[51,32,52,36],[51,37,52,54],[53,32,54,36],[53,37,54,54],[55,32,56,36],[55,37,56,54],[29,50,29,54],[30,50,30,54],[28,25,28,36],[29,25,29,36],[30,45,30,49],[30,37,30,44],[30,25,30,36],[28,37,28,44],[29,37,29,44],[27,37,27,44],[27,25,27,36],[27,13,27,24],[27,45,27,49],[5,0,6,8],[0,56,0,57],[0,58,0,59],[3,39,4,47],[3,37,4,38],[5,54,6,55],[3,48,4,52],[5,52,6,53],[5,50,6,51],[5,48,6,49],[5,46,6,47],[5,44,6,45],[5,41,6,43],[1,33,6,34],[0,33,0,34],[25,13,25,17],[0,60,0,61],[2,2,4,27],[28,13,28,24],[29,13,29,24],[26,13,26,44],[26,45,26,54],[26,3,27,8],[17,27,18,31],[17,32,18,53],[19,27,20,31],[19,32,20,53],[21,27,22,31],[21,32,22,53],[24,3,24,8],[25,44,25,45],[25,52,25,55],[25,50,25,51],[1,29,6,30],[1,31,6,32],[1,35,2,55],[5,35,6,40],[0,29,0,30],[0,31,0,32],[3,53,4,54],[31,13,31,24],[31,50,31,54],[31,45,31,49],[31,37,31,44],[31,25,31,36],[32,35,32,36],[32,26,32,27],[32,28,32,29],[44,5,47,6],[36,12,36,55],[37,12,37,55],[34,13,34,18],[34,20,34,36],[34,37,34,40],[34,42,34,55],[35,4,35,9],[35,37,35,40],[35,42,35,55],[34,3,34,8],[36,3,36,8],[37,3,37,8],[43,13,44,18],[43,19,44,24],[43,25,44,30]]}
[]
[null,null,null,null,null,null,null,null,null,null,null,null,null,null,null,null,null,null,null,null,null,null,null,null,null,null,null,null,null,"新規",null,"変更",null,"工期延長",null,"従前の許可書の番号・許可日"]
[null,null,"法定外公共物工事許可申請書"]
[null,null,null,null,null,null,null,null,null,null,null,null,null,null,null,null,null,null,null,null,null,null,null,null,null,null,null,null,null,null,null,null,null,null,null,null,null,null,null,"吹田市指令土道第",null,null,null,null,null,null,null,null,null,null,null,null,null,"号"]
[]
["要領様式第14号",null,null,null,null,null,null,null,null,null,null,null,null,null,null,null,null,null,null,null,null,null,null,null,null,null,null,null,null,null,null,null,null,null,null,"(許可日)",null,null,null,null,null,"令和",null,null,null,null,"年",null,null,null,"月",null,null,null,"日"]
[]
[null,null,null,null,null,null,null,null,null,null,null,null,null,null,null,null,null,null,null,null,null,null,null,null,null,null,null,null,null,null,null,null,null,null,null,null,null,null,null,"令和",null,null,null,null,"年",null,null,null,"月",null,null,null,"日"]
[null,null,null,"吹　田　市　長　　宛",null,null,null,null,null,null,null,null,null,null,null,null,null,null,null,null,null,null,null,null,null,null,"〒"]
[]
[]
[null,null,null,null,null,null,null,null,null,null,null,null,null,null,null,null,null,null,null,null,null,null,null,null,null,null,"住所"]
[null,null,null,null,null,null,null,null,null,null,null,null,null,null,null,null,null,null,"申　請　者"]
[]
[null,null,null,null,null,null,null,null,null,null,null,null,null,null,null,null,null,null,null,null,null,null,null,null,null,null,"氏名"]
[]
[]
[null,null,null,null,null,null,null,null,null,null,null,null,null,null,null,null,null,null,null,null,null,null,null,null,null,null,null,"担当者"]
[]
[null,null,null,null,null,null,null,null,null,null,null,null,null,null,null,null,null,null,null,null,null,null,null,null,null,null,null,"電　話",null,null,null,null,{"$f":"IFERROR(VLOOKUP(申請書.申請者\\担当者,担当者設定!A3:C7,2,FALSE)&\"\",\"\")","v":""}]
[]
[null,null,null,null,null,null,null,null,null,null,null,null,null,null,null,null,null,null,null,null,null,null,null,null,null,null,null,"E-mail",null,null,null,null,{"$f":"IFERROR(VLOOKUP(申請書.申請者\\担当者,担当者設定!A3:C7,3,FALSE)&\"\",\"\")","v":""}]
[]
[null,"吹田市認定外道路・水路等管理条例第10条第１項の規定により、法定外公共物の工事の許可を申請します。"]
[null,null,null,"工事目的"]
[null,null,null,"工事場所",null,null,null,null,null,null,null,null,null,"吹田市",null,null,null,null,null,null,null,null,null,null,null,null,null,null,null,null,null,null,null,null,null,null,null,null,null,null,"車道・",null,null,null,null,null,"歩道・",null,null,null,null,null,"その他"]
[null,null,null,"工事内容",null,null,null,null,null,null,null,null,null,"工事種別",null,null,null,null,null,null,null,null,null,null,null,null,null,null,null,null,null,null,null,null,null,null,null,null,null,null,null,null,null,null,null,"数量"]
[]
[]
[]
[]
[]
[null,null,null,"工事期間",null,null,null,null,null,null,null,null,null,"令和",null,null,null,null,"年",null,null,null,"月",null,null,null,"日",null,"から",null,"令和",null,null,null,null,"年",null,null,null,"月",null,null,null,"日",null,null,"(",null,null,null,null,"日間)"]
[null,null,null,"工事業者",null,null,null,null,null,null,null,null,null,"住所",null,null,null,null,null,null,{"$f":"IFERROR(VLOOKUP(申請書.工事業者連絡先\\事業者名,担当者設定!A11:E15,2,FALSE)&\"\",\"\")","v":""},null,null,null,null,null,null,null,null,null,null,null,null,null,null,null,null,"担当者",null,null,null,null,{"$f":"IFERROR(VLOOKUP(申請書.工事業者連絡先\\事業者名,担当者設定!A11:E15,3,FALSE)&\"\",\"\")","v":""}]
[null,null,null,"連絡先",null,null,null,null,null,null,null,null,null,"事業者名",null,null,null,null,null,null,null,null,null,null,null,null,null,null,null,null,null,null,null,null,null,null,null,"電　話",null,null,null,null,{"$f":"IFERROR(VLOOKUP(申請書.工事業者連絡先\\事業者名,担当者設定!A11:E15,4,FALSE)&\"\",\"\")","v":""}]
[null,null,null,null,null,null,null,null,null,null,null,null,null,null,null,null,null,null,null,null,null,null,null,null,null,null,null,null,null,null,null,null,null,null,null,null,null,"E-mail",null,null,null,null,{"$f":"IFERROR(VLOOKUP(申請書.工事業者連絡先\\事業者名,担当者設定!A11:E15,5,FALSE)&\"\",\"\")","v":""}]
[null,null,null,"添付書類"]
[null,null,null,"その他"]
["吹田市\n記載欄",null,null,null,null,"起案",null,null,null,null,null,null,null,null,null,null,null,"決裁",null,null,null,null,null,null,null,null,null,null,null,"施行",null,null,null,null,null,null,null,null,null,null,null,"  吹田市指令土道第      号"]
[null,null,null,null,null,"　　    年    月    日",null,null,null,null,null,null,null,null,null,null,null,"　　    年    月    日",null,null,null,null,null,null,null,null,null,null,null,"　　    年    月    日"]
[null,null,null,null,null,"上記の法定外公共物の工事について、要領様式第16号のとおり所管警察署長に協議し、\nその回答を得たうえで、許可してよろしいですか。"]
[]
[]
[null,null,null,null,null,null,null,null,null,null,null,null,null,"参事",null,null,null,null,null,"主幹",null,null,null,null,null,"主査",null,null,null,null,null,"起案者",null,null,null,null,null,"合議"]
[null,null,null,null,null,"主管"]
[]
[]
[]
[]
[null,"備考",null,null,null,null,null,null,null,null,null,null,null,null,null,null,null,null,null,null,null,null,null,null,null,null,null,null,null,null,null,"申請書に関する連絡先担当（任意記入）"]
[]
[null,null,null,null,null,null,null,null,null,null,null,null,null,null,null,null,null,null,null,null,null,null,null,null,null,null,null,null,null,null,null,null,"担当者"]
[]
[null,null,null,null,null,null,null,null,null,null,null,null,null,null,null,null,null,null,null,null,null,null,null,null,null,null,null,null,null,null,null,null,"電話",null,null,null,null,{"$f":"IFERROR(VLOOKUP(申請書.申請書連絡先\\担当者,担当者設定!A19:C23,2,FALSE)&\"\",\"\")","v":""}]
[]
[null,null,null,null,null,null,null,null,null,null,null,null,null,null,null,null,null,null,null,null,null,null,null,null,null,null,null,null,null,null,null,null,"E-mail",null,null,null,null,{"$f":"IFERROR(VLOOKUP(申請書.申請書連絡先\\担当者,担当者設定!A19:C23,3,FALSE)&\"\",\"\")","v":""}]
[]
[]
[]
[]
[]
[]
["受付印"]

{"sheet":"担当者設定","index":1,"n_rows":23,"n_cols":5,"rows_kept":23,"cut":false,"hidden":false,"merged":[]}
["申請者"]
["担当者名","電話番号","E-mail"]
["申請者　１太郎","123-4567-8901","aaa1@abc.com"]
["申請者　２太郎","123-4567-8902","aaa2@abc.com"]
["申請者　３太郎","123-4567-8903","aaa3@abc.com"]
["申請者　４太郎","123-4567-8904","aaa4@abc.com"]
["申請者　５太郎","123-4567-8905","aaa5@abc.com"]
["工事業者"]
["事業者名","住所","担当者名","電話番号","E-mail"]
[]
["株式会社　AAAA","大阪府吹田市吹田町１丁目１－１","工事業者　１太郎","223-4567-8901","bbb1@abc.com"]
["株式会社　BBBB","大阪府吹田市吹田町２丁目２－２","工事業者　２太郎","223-4567-8902","bbb2@abc.com"]
["株式会社　CCCC","大阪府吹田市吹田町３丁目３－３","工事業者　３太郎","223-4567-8903","bbb3@abc.com"]
["株式会社　DDDD","大阪府吹田市吹田町４丁目４－４","工事業者　４太郎","223-4567-8904","bbb4@abc.com"]
["株式会社　EEEE","大阪府吹田市吹田町５丁目５－５","工事業者　５太郎","223-4567-8905","bbb5@abc.com"]
[]
["申請書に関する連絡先担当"]
["担当者名","電話番号","E-mail"]
["連絡先　１太郎","323-4567-8901","ccc1@abc.com"]
["連絡先　２太郎","323-4567-8902","ccc2@abc.com"]
["連絡先　３太郎","323-4567-8903","ccc3@abc.com"]
["連絡先　４太郎","323-4567-8904","ccc4@abc.com"]
["連絡先　５太郎","323-4567-8905","ccc5@abc.com"]

{"sheet":"データ_コード表","index":2,"n_rows":29,"n_cols":2,"rows_kept":29,"cut":false,"hidden":true,"merged":[]}
["工事目的"]
["値","コード"]
["歩道の切下げ工事（本設）",1]
["歩道の切下げ工事（仮設）",2]
["事故復旧工事",3]
["舗装本復旧工事",4]
["ガス本復旧工事",5]
["給水本復旧工事",6]
["下水本復旧工事",7]
["側溝改修工事",8]
["側溝補修工事",9]
["グレーチング設置工事",10]
["樹木剪定工事",11]
["試掘工事",12]
["車止め撤去工事",13]
["横断防止柵撤去工事",14]
["転落防止柵撤去工事",15]
["電線共同溝管路敷設工事",16]
["街渠桝補修工事",17]
["その他（）　※（）内は自由記述",18]
[]
["申請区分"]
["値","コード"]
["新規",10]
["更新",20]
["変更",30]
["工期延長",40]
["申請者変更",50]
["廃止",60]

{"sheet":"データ_選択肢","index":3,"n_rows":3,"n_cols":1,"rows_kept":3,"cut":false,"hidden":true,"merged":[]}
["○選択"]
[]
["○"]

{"sheet":"M_添付書類","index":4,"n_rows":16,"n_cols":3,"rows_kept":16,"cut":false,"hidden":true,"merged":[]}
["添付書類コード","添付書類","並び順"]
[31,"付近見取り図",31]
[32,"現況平面図",32]
[33,"計画平面図",33]
[34,"断面図",34]
[35,"構造図",35]
[36,"交通対策図",36]
[37,"現況写真",37]
[38,"吹田警察との協議録",38]
[39,"下水道部との協議録",39]
[40,"水利組合との協議録",40]
[41,"隣接扡所有者の承諾書",41]
[42,"構造計算書",42]
[43,"樹木撤去申請書の写し",43]
[44,"法定外公共物工事許可書の写し",44]
[45,"その他",45]

{"sheet":"M_数量単位","index":5,"n_rows":8,"n_cols":3,"rows_kept":8,"cut":false,"hidden":true,"merged":[]}
["数量単位コード","数量単位","並び順"]
[1,"本",1]
[2,"ｍ",2]
[3,"個",3]
[4,"㎡",4]
[5,"基",5]
[6,"箇所",6]
[7,"自由入力",7]

{"sheet":"M_工事内容_項目1","index":6,"n_rows":6,"n_cols":3,"rows_kept":6,"cut":false,"hidden":true,"merged":[]}
["工事内容_項目1コード","工事内容_項目1","並び順"]
[1,"舗装工",1]
[2,"歩道乗入部設置工",2]
[3,"排水設備工",3]
[4,"区画線工",4]
[5,"道路付属物工",5]

{"sheet":"M_工事内容_項目2","index":7,"n_rows":28,"n_cols":4,"rows_kept":28,"cut":false,"hidden":true,"merged":[]}
["工事内容_項目1コード","工事内容_項目2コード","工事内容_項目2","並び順"]
[1,1,"アスファルト",1]
[1,2,"インターロッキング",2]
[1,3,"平板ブロック",3]
[1,4,"その他",4]
[2,1,"本設",1]
[2,2,"仮設",2]
[2,3,"水路",3]
[2,4,"その他",4]
[3,1,"U型側溝",1]
[3,2,"L型側溝",2]
[3,3,"集水桝",3]
[3,4,"その他",4]
[4,1,"交差点マーク",1]
[4,2,"外側線",2]
[4,3,"路側線",3]
[4,4,"その他",4]
[5,1,"樹木",1]
[5,2,"横断防止柵",2]
[5,3,"転落防止柵",3]
[5,4,"車両用防護柵",4]
[5,5,"標識",7]
[5,6,"街路灯",8]
[5,7,"反射鏡",9]
[5,8,"その他",11]
[5,9,"ガードレール",5]
[5,10,"車止め",6]
[5,11,"縁石",10]

{"sheet":"M_工事内容_項目3","index":8,"n_rows":135,"n_cols":7,"rows_kept":135,"cut":false,"hidden":true,"merged":[]}
["工事内容_項目1コード","工事内容_項目2コード","工事内容_項目3コード","工事内容_項目2","並び順","名目コード_初期値","単位コード_初期値"]
[1,1,1,"新設",1,null,4]
[1,1,2,"改修",2,null,4]
[1,1,3,"補修",3,null,4]
[1,1,4,"撤去",4,null,4]
[1,1,5,"その他",5,null,4]
[1,2,1,"新設",1,null,4]
[1,2,2,"改修",2,null,4]
[1,2,3,"補修",3,null,4]
[1,2,4,"撤去",4,null,4]
[1,2,5,"その他",5,null,4]
[1,3,1,"新設",1,null,4]
[1,3,2,"改修",2,null,4]
[1,3,3,"補修",3,null,4]
[1,3,4,"撤去",4,null,4]
[1,3,5,"その他",5,null,4]
[1,4,1,"新設",1,null,4]
[1,4,2,"改修",2,null,4]
[1,4,3,"補修",3,null,4]
[1,4,4,"撤去",4,null,4]
[1,4,5,"その他",5,null,4]
[2,1,1,"新設",1,null,4]
[2,1,2,"改修",2,null,4]
[2,1,3,"補修",3,null,4]
[2,1,4,"撤去",4,null,4]
[2,1,5,"その他",5,null,4]
[2,2,1,"新設",1,null,4]
[2,2,2,"改修",2,null,4]
[2,2,3,"補修",3,null,4]
[2,2,4,"撤去",4,null,4]
[2,2,5,"その他",5,null,4]
[2,3,1,"新設",1,null,4]
[2,3,2,"改修",2,null,4]
[2,3,3,"補修",3,null,4]
[2,3,4,"撤去",4,null,4]
[2,3,5,"その他",5,null,4]
[2,4,1,"新設",1,null,4]
[2,4,2,"改修",2,null,4]
[2,4,3,"補修",3,null,4]
[2,4,4,"撤去",4,null,4]
[2,4,5,"その他",5,null,4]
[3,1,1,"新設",1,null,2]
[3,1,2,"改修",2,null,2]
[3,1,3,"補修",3,null,2]
[3,1,4,"撤去",4,null,2]
[3,1,5,"ｸﾞﾚｰﾁﾝｸﾞ設置",5,null,2]
[3,1,6,"ｸﾞﾚｰﾁﾝｸﾞ撤去",6,null,2]
[3,1,7,"その他",7,null,2]
[3,2,1,"新設",1,null,2]
[3,2,2,"改修",2,null,2]
[3,2,3,"補修",3,null,2]
[3,2,4,"撤去",4,null,2]
[3,2,5,"その他",5,null,2]
[3,3,1,"新設",1,null,6]
[3,3,2,"改修",2,null,6]
[3,3,3,"補修",3,null,6]
[3,3,4,"撤去",4,null,6]
[3,3,5,"その他",5,null,6]
[3,4,1,"新設",1,null,6]
[3,4,2,"改修",2,null,6]
[3,4,3,"補修",3,null,6]
[3,4,4,"撤去",4,null,6]
[3,4,5,"その他",5,null,6]
[4,1,1,"新設",1,null,6]
[4,1,2,"補修",2,null,6]
[4,1,3,"消去",3,null,6]
[4,1,4,"その他",4,null,6]
[4,2,1,"新設",1,null,2]
[4,2,2,"補修",2,null,2]
[4,2,3,"消去",3,null,2]
[4,2,4,"その他",4,null,2]
[4,3,1,"新設",1,null,2]
[4,3,2,"補修",2,null,2]
[4,3,3,"消去",3,null,2]
[4,3,4,"その他",4,null,2]
[4,4,1,"新設",1,null,2]
[4,4,2,"補修",2,null,2]
[4,4,3,"消去",3,null,2]
[4,4,4,"その他",4,null,2]
[4,4,5,"ー",5,null,2]
[5,1,1,"新設",1,null,4]
[5,1,2,"移設",2,null,4]
[5,1,3,"補修",3,null,4]
[5,1,4,"撤去",4,null,4]
[5,1,5,"その他",5,null,4]
[5,2,1,"新設",1,null,2]
[5,2,2,"改修",2,null,2]
[5,2,3,"補修",3,null,2]
[5,2,4,"撤去",4,null,2]
[5,2,5,"その他",5,null,2]
[5,3,1,"新設",1,null,2]
[5,3,2,"改修",2,null,2]
[5,3,3,"補修",3,null,2]
[5,3,4,"撤去",4,null,2]
[5,3,5,"その他",5,null,2]
[5,4,1,"新設",1,null,2]
[5,4,2,"改修",2,null,2]
[5,4,3,"補修",3,null,2]
[5,4,4,"撤去",4,null,2]
[5,4,5,"その他",5,null,2]
[5,5,1,"新設",1,null,1]
[5,5,2,"移設",2,null,1]
[5,5,3,"補修",3,null,1]
[5,5,4,"撤去",4,null,1]
[5,5,5,"その他",5,null,1]
[5,6,1,"新設",1,null,1]
[5,6,2,"移設",2,null,1]
[5,6,3,"補修",3,null,1]
[5,6,4,"撤去",4,null,1]
[5,6,5,"その他",5,null,1]
[5,7,1,"新設",1,null,1]
[5,7,2,"移設",2,null,1]
[5,7,3,"補修",3,null,1]
[5,7,4,"撤去",4,null,1]
[5,7,5,"その他",5,null,1]
[5,8,1,"新設",1,null,2]
[5,8,2,"改修",2,null,4]
[5,8,3,"補修",3,null,1]
[5,8,4,"撤去",4]
[5,8,5,"その他",5]
[5,9,1,"新設",1,null,2]
[5,9,2,"移設",2,null,2]
[5,9,3,"補修",3,null,2]
[5,9,4,"撤去",4,null,2]
[5,9,5,"その他",5,null,2]
[5,10,1,"新設",1,null,1]
[5,10,2,"移設",2,null,1]
[5,10,3,"補修",3,null,1]
[5,10,4,"撤去",4,null,1]
[5,10,5,"その他",5,null,1]
[5,11,1,"新設",1,null,2]
[5,11,2,"改修",2,null,2]
[5,11,3,"補修",3,null,2]
[5,11,4,"撤去",4,null,2]
[5,11,5,"その他",5,null,2]

{"sheet":"(Validate)","index":9,"n_rows":1,"n_cols":2,"rows_kept":1,"cut":false,"hidden":true,"merged":[]}
["MasterTempFile","C:\\Users\\K0FD3~1.MAE\\AppData\\Local\\Temp\\SuiA1E6.tmp"]